D3D Shader Compilation Fails

Questions about Wine on Linux
Post Reply
ttragedia
Newbie
Newbie
Posts: 3
Joined: Sun Jan 27, 2019 6:04 pm

D3D Shader Compilation Fails

Post by ttragedia » Sun Jan 27, 2019 6:29 pm

Hello all,
I've been banging my head over this problem for about 10 hours now (in a span of 3 days) and would appreciate any help to show me the right direction. I'am successfully using wine and this exact .exe without any problems in my other system, which did not require much configuration to run the file through wine. (It was a system with NVIDIA Optimus though.).

Now the error message I'm getting is:

Code: Select all

[00:00:00]: 
System Memory:
	Memory Load: 17%
	Available Physical Memory: 6372m/7723m
	Available Page File: 19146m/20498m
	Available Virtual Memory: 4095m/4095m
	Available Extended Virtual Memory: 0m
[00:00:00]: 
Process Memory:
	Peak Working Set Size: 50m
	Working Set Size: 50m
	Quota Peak Page Pool Usage: 0k
	Quota Page Pool Usage: 0k
	Quota Peak Non Paged Pool Usage:0k
	Quota Non Paged Pool Usage: 0k
	Page File Usage: 17m
	Peak Page File Usage: 17m
[00:00:00]: PersistRootStorage is now APP:Klei//DoNotStarveTogether/ 
[00:00:00]: Starting Up
[00:00:00]: Version: 298000
[00:00:00]: Current time: Mon Jan 28 02:19:16 2019

[00:00:00]: Don't Starve Together: 298000 WIN32_STEAM
[00:00:00]: Build Date: 3673
[00:00:00]: Parsing command line
[00:00:00]: Command Line Arguments: 
[00:00:00]: Initializing distribution platform
[00:00:00]: Initializing Minidump handler
[00:00:00]: ....Done
[00:00:00]: Steam AppBuildID: 1
[00:00:00]: Steam BetaName(Branch): [public]
[00:00:00]: ....Done
[00:00:00]: PersistUserStorage is now APP:Klei//DoNotStarveTogether/1667950317/ 
[00:00:00]: Fixing DPI
[00:00:00]: ...Done
[00:00:00]: THREAD - started 'GAClient' (46)
[00:00:00]: CurlRequestManager::ClientThread::Main()
[00:00:00]: Mounting file system databundles/klump.zip successful.
[00:00:00]: Mounting file system databundles/shaders.zip successful.
[00:00:00]: Mounting file system databundles/fonts.zip successful.
[00:00:00]: Mounting file system databundles/anim_dynamic.zip successful.
[00:00:00]: Mounting file system databundles/bigportraits.zip successful.
[00:00:00]: Mounting file system databundles/images.zip successful.
[00:00:00]: Mounting file system databundles/scripts.zip successful.
[00:00:00]: ProfileIndex:3.80
[00:00:00]: [Connect] PendingConnection::Reset(true)
[00:00:00]: THREAD - started 'Ping Job Thread' (47)
[00:00:00]: Platform: 1
[00:00:00]: Network tick rate: U=15(2), D=0
[00:00:00]: Authorized application Z:\home\caesium\workspace\games\dont-starve-together\bin\dontstarve_steam.exe is disabled in the firewall.
[00:00:00]: Authorized application Z:\home\caesium\workspace\games\dont-starve-together\bin\dontstarve_steam.exe is now enabled in the firewall.
[00:00:00]: THREAD - started 'StreamInput' (48)
[00:00:00]: could not load ping_cache
[00:00:00]: Offline user ID: OU_76561199628216045
[00:00:00]: SteamID: 76561199628216045
[00:00:00]: HardwareStats:
  OS                        
    name                      Microsoft Windows 7 Professional
    version                   6.1.7601
    architecture              64-bit
    platformSpecific          SP 1.0
  CPU                       
    numCores                  1
    features                  SSE,SSE2,SSE3,SSSE3,SSE41,SSE42,AVX
    name                      Intel(R) Core(TM) i5-6300U CPU @ 2.40GHz
    manufacturer              GenuineIntel
    clockSpeed                3000
  RAM                       
    megsOfRam                 7723
  GPU                       
    name                      Intel(R) HD Graphics 520
    driverDate                20170101000000.000000+000
    megsOfRam                 3072
    refreshRate               0
    videoModeDescription      1366 x 768 x 4294967296 colors
    driverVersion             1.0

[00:00:00]: cGame::InitializeOnMainThread
[00:00:00]: WindowManager::Initialize
[00:00:00]: CreateWindow: Requesting 1280,720 - 5/6/5 - -1/-1/-1 - 0
CreateWindow: Requesting 1280,720 - 5/6/5 - -1/-1/-1 - 0[00:00:00]: CreateEGLContext: 15 configs found
CreateEGLContext: 15 configs found[00:00:00]:      0: 8/8/8 -  0/ 0/ 0 - 0
     0: 8/8/8 -  0/ 0/ 0 - 0[00:00:00]:      1: 8/8/8 -  0/16/ 0 - 0
     1: 8/8/8 -  0/16/ 0 - 0[00:00:00]:      2: 8/8/8 -  0/24/ 0 - 0
     2: 8/8/8 -  0/24/ 0 - 0[00:00:00]:      3: 8/8/8 -  0/24/ 8 - 0
     3: 8/8/8 -  0/24/ 8 - 0[00:00:00]:      4: 8/8/8 -  0/32/ 0 - 0
     4: 8/8/8 -  0/32/ 0 - 0[00:00:00]:      5: 5/5/5 -  0/ 0/ 0 - 0
     5: 5/5/5 -  0/ 0/ 0 - 0[00:00:00]:      6: 5/5/5 -  0/16/ 0 - 0
     6: 5/5/5 -  0/16/ 0 - 0[00:00:00]:      7: 5/5/5 -  0/24/ 0 - 0
     7: 5/5/5 -  0/24/ 0 - 0[00:00:00]:      8: 5/5/5 -  0/24/ 8 - 0
     8: 5/5/5 -  0/24/ 8 - 0[00:00:00]:      9: 5/5/5 -  0/32/ 0 - 0
     9: 5/5/5 -  0/32/ 0 - 0[00:00:00]:     10: 8/8/8 -  8/ 0/ 0 - 0
    10: 8/8/8 -  8/ 0/ 0 - 0[00:00:00]:     11: 8/8/8 -  8/16/ 0 - 0
    11: 8/8/8 -  8/16/ 0 - 0[00:00:00]:     12: 8/8/8 -  8/24/ 0 - 0
    12: 8/8/8 -  8/24/ 0 - 0[00:00:00]:     13: 8/8/8 -  8/24/ 8 - 0
    13: 8/8/8 -  8/24/ 8 - 0[00:00:00]:     14: 8/8/8 -  8/32/ 0 - 0
    14: 8/8/8 -  8/32/ 0 - 0[00:00:00]: GLInfo
[00:00:00]: ~~~~~~
[00:00:00]: GL_VENDOR: Google Inc.
[00:00:00]: GL_RENDERER: ANGLE (Intel(R) HD Graphics 520)
[00:00:00]: GL_VERSION: OpenGL ES 2.0 (ANGLE 1.0.0.2249)
[00:00:00]: GL_SHADING_LANGUAGE_VERSION: OpenGL ES GLSL ES 1.00 (ANGLE 1.0.0.2249)
[00:00:00]: OpenGL extensions (19, 19):
[00:00:00]: GL_ANGLE_depth_texture
[00:00:00]: GL_ANGLE_framebuffer_blit
[00:00:00]: GL_ANGLE_framebuffer_multisample
[00:00:00]: GL_ANGLE_instanced_arrays
[00:00:00]: GL_ANGLE_pack_reverse_row_order
[00:00:00]: GL_ANGLE_texture_compression_dxt3
[00:00:00]: GL_ANGLE_texture_compression_dxt5
[00:00:00]: GL_ANGLE_texture_usage
[00:00:00]: GL_ANGLE_translated_shader_source
[00:00:00]: GL_EXT_read_format_bgra
[00:00:00]: GL_EXT_robustness
[00:00:00]: GL_EXT_texture_compression_dxt1
[00:00:00]: GL_EXT_texture_format_BGRA8888
[00:00:00]: GL_EXT_texture_storage
[00:00:00]: GL_OES_get_program_binary
[00:00:00]: GL_OES_packed_depth_stencil
[00:00:00]: GL_OES_rgb8_rgba8
[00:00:00]: GL_OES_standard_derivatives
[00:00:00]: GL_OES_texture_npot
[00:00:00]: GL_MAX_TEXTURE_SIZE = 16384
[00:00:00]: GL_MAX_TEXTURE_IMAGE_UNITS = 16
[00:00:00]: GL_MAX_RENDERBUFFER_SIZE = 16384
[00:00:00]: GL_MAX_VIEWPORT_DIMS = 16384, 16384
[00:00:00]: GL_MAX_VARYING_VECTORS = 10
[00:00:00]: GL_MAX_VERTEX_ATTRIBS = 16
[00:00:00]: GL_MAX_VERTEX_UNIFORM_VECTORS = 254
[00:00:00]: GL_MAX_VERTEX_TEXTURE_IMAGE_UNITS = 4
[00:00:00]: GL_MAX_FRAGMENT_UNIFORM_VECTORS = 221
[00:00:00]: 4 compressed texture formats
[00:00:00]: texture format 0x83f0
[00:00:00]: texture format 0x83f1
[00:00:00]: texture format 0x83f2
[00:00:00]: texture format 0x83f3
[00:00:00]: THREAD - started 'WindowsInputManager' (51)
[00:00:00]: Compiled shader font: :37:29: error: syntax error, unexpected NEW_IDENTIFIER

Warning: D3D shader compilation failed with default flags. Retrying with avoid flow control.
:37:29: error: syntax error, unexpected NEW_IDENTIFIER

Warning: D3D shader compilation failed with avoid flow control flags. Retrying with prefer flow control.
:37:29: error: syntax error, unexpected NEW_IDENTIFIER

Warning: D3D shader compilation failed with prefer flow control flags.:12:17: error: syntax error, unexpected NEW_IDENTIFIER

Warning: D3D shader compilation failed with default flags. Retrying with avoid flow control.
:12:17: error: syntax error, unexpected NEW_IDENTIFIER

Warning: D3D shader compilation failed with avoid flow control flags. Retrying with prefer flow control.
:12:17: error: syntax error, unexpected NEW_IDENTIFIER

Warning: D3D shader compilation failed with prefer flow control flags.
[00:00:00]: Compiled shader font_packed: :37:29: error: syntax error, unexpected NEW_IDENTIFIER

Warning: D3D shader compilation failed with default flags. Retrying with avoid flow control.
:37:29: error: syntax error, unexpected NEW_IDENTIFIER

Warning: D3D shader compilation failed with avoid flow control flags. Retrying with prefer flow control.
:37:29: error: syntax error, unexpected NEW_IDENTIFIER

Warning: D3D shader compilation failed with prefer flow control flags.:17:17: error: syntax error, unexpected NEW_IDENTIFIER

Warning: D3D shader compilation failed with default flags. Retrying with avoid flow control.
:17:17: error: syntax error, unexpected NEW_IDENTIFIER

Warning: D3D shader compilation failed with avoid flow control flags. Retrying with prefer flow control.
:17:17: error: syntax error, unexpected NEW_IDENTIFIER

Warning: D3D shader compilation failed with prefer flow control flags.
[00:00:00]: Compiled shader font_packed_outline: :37:29: error: syntax error, unexpected NEW_IDENTIFIER

Warning: D3D shader compilation failed with default flags. Retrying with avoid flow control.
:37:29: error: syntax error, unexpected NEW_IDENTIFIER

Warning: D3D shader compilation failed with avoid flow control flags. Retrying with prefer flow control.
:37:29: error: syntax error, unexpected NEW_IDENTIFIER

Warning: D3D shader compilation failed with prefer flow control flags.:17:17: error: syntax error, unexpected NEW_IDENTIFIER

Warning: D3D shader compilation failed with default flags. Retrying with avoid flow control.
:17:17: error: syntax error, unexpected NEW_IDENTIFIER

Warning: D3D shader compilation failed with avoid flow control flags. Retrying with prefer flow control.
:17:17: error: syntax error, unexpected NEW_IDENTIFIER

Warning: D3D shader compilation failed with prefer flow control flags.
[00:00:00]: Compiled shader ui: :29:19: error: syntax error, unexpected NEW_IDENTIFIER

Warning: D3D shader compilation failed with default flags. Retrying with avoid flow control.
:29:19: error: syntax error, unexpected NEW_IDENTIFIER

Warning: D3D shader compilation failed with avoid flow control flags. Retrying with prefer flow control.
:29:19: error: syntax error, unexpected NEW_IDENTIFIER

Warning: D3D shader compilation failed with prefer flow control flags.:12:17: error: syntax error, unexpected NEW_IDENTIFIER

Warning: D3D shader compilation failed with default flags. Retrying with avoid flow control.
:12:17: error: syntax error, unexpected NEW_IDENTIFIER

Warning: D3D shader compilation failed with avoid flow control flags. Retrying with prefer flow control.
:12:17: error: syntax error, unexpected NEW_IDENTIFIER

Warning: D3D shader compilation failed with prefer flow control flags.
[00:00:00]: Compiled shader ui_yuv: :29:19: error: syntax error, unexpected NEW_IDENTIFIER

Warning: D3D shader compilation failed with default flags. Retrying with avoid flow control.
:29:19: error: syntax error, unexpected NEW_IDENTIFIER

Warning: D3D shader compilation failed with avoid flow control flags. Retrying with prefer flow control.
:29:19: error: syntax error, unexpected NEW_IDENTIFIER

Warning: D3D shader compilation failed with prefer flow control flags.:12:17: error: syntax error, unexpected NEW_IDENTIFIER

Warning: D3D shader compilation failed with default flags. Retrying with avoid flow control.
:12:17: error: syntax error, unexpected NEW_IDENTIFIER

Warning: D3D shader compilation failed with avoid flow control flags. Retrying with prefer flow control.
:12:17: error: syntax error, unexpected NEW_IDENTIFIER

Warning: D3D shader compilation failed with prefer flow control flags.
[00:00:00]: Compiled shader ui_anim: :31:29: error: syntax error, unexpected NEW_IDENTIFIER

Warning: D3D shader compilation failed with default flags. Retrying with avoid flow control.
:31:29: error: syntax error, unexpected NEW_IDENTIFIER

Warning: D3D shader compilation failed with avoid flow control flags. Retrying with prefer flow control.
:31:29: error: syntax error, unexpected NEW_IDENTIFIER

Warning: D3D shader compilation failed with prefer flow control flags.:17:17: error: syntax error, unexpected NEW_IDENTIFIER

Warning: D3D shader compilation failed with default flags. Retrying with avoid flow control.
:17:17: error: syntax error, unexpected NEW_IDENTIFIER

Warning: D3D shader compilation failed with avoid flow control flags. Retrying with prefer flow control.
:17:17: error: syntax error, unexpected NEW_IDENTIFIER

Warning: D3D shader compilation failed with prefer flow control flags.
[00:00:00]: Compiled shader debug_line: :29:29: error: syntax error, unexpected NEW_IDENTIFIER

Warning: D3D shader compilation failed with default flags. Retrying with avoid flow control.
:29:29: error: syntax error, unexpected NEW_IDENTIFIER

Warning: D3D shader compilation failed with avoid flow control flags. Retrying with prefer flow control.
:29:29: error: syntax error, unexpected NEW_IDENTIFIER

Warning: D3D shader compilation failed with prefer flow control flags.:12:16: warning: implicit truncation of vector type
Line 30: variable 'gl_main' not declared

Warning: D3D shader compilation failed with default flags. Retrying with avoid flow control.
:12:16: warning: implicit truncation of vector type
Line 30: variable 'gl_main' not declared

Warning: D3D shader compilation failed with avoid flow control flags. Retrying with prefer flow control.
:12:16: warning: implicit truncation of vector type
Line 30: variable 'gl_main' not declared

Warning: D3D shader compilation failed with prefer flow control flags.
[00:00:00]: Compiled shader debug_tri: :33:29: error: syntax error, unexpected NEW_IDENTIFIER

Warning: D3D shader compilation failed with default flags. Retrying with avoid flow control.
:33:29: error: syntax error, unexpected NEW_IDENTIFIER

Warning: D3D shader compilation failed with avoid flow control flags. Retrying with prefer flow control.
:33:29: error: syntax error, unexpected NEW_IDENTIFIER

Warning: D3D shader compilation failed with prefer flow control flags.:12:17: error: syntax error, unexpected NEW_IDENTIFIER

Warning: D3D shader compilation failed with default flags. Retrying with avoid flow control.
:12:17: error: syntax error, unexpected NEW_IDENTIFIER

Warning: D3D shader compilation failed with avoid flow control flags. Retrying with prefer flow control.
:12:17: error: syntax error, unexpected NEW_IDENTIFIER

Warning: D3D shader compilation failed with prefer flow control flags.
[00:00:00]: ERROR: HWTexture::DeserializeTexture failed on images/circle.tex. glGetError returned 0x502
[00:00:00]: 64x64 format: 0x83f3 mips: 7
[00:00:00]: Compiled shader debug_line: :29:29: error: syntax error, unexpected NEW_IDENTIFIER

Warning: D3D shader compilation failed with default flags. Retrying with avoid flow control.
:29:29: error: syntax error, unexpected NEW_IDENTIFIER

Warning: D3D shader compilation failed with avoid flow control flags. Retrying with prefer flow control.
:29:29: error: syntax error, unexpected NEW_IDENTIFIER

Warning: D3D shader compilation failed with prefer flow control flags.:12:16: warning: implicit truncation of vector type
Line 30: variable 'gl_main' not declared

Warning: D3D shader compilation failed with default flags. Retrying with avoid flow control.
:12:16: warning: implicit truncation of vector type
Line 30: variable 'gl_main' not declared

Warning: D3D shader compilation failed with avoid flow control flags. Retrying with prefer flow control.
:12:16: warning: implicit truncation of vector type
Line 30: variable 'gl_main' not declared

Warning: D3D shader compilation failed with prefer flow control flags.
[00:00:00]: Compiled shader debug_tri: :33:29: error: syntax error, unexpected NEW_IDENTIFIER

Warning: D3D shader compilation failed with default flags. Retrying with avoid flow control.
:33:29: error: syntax error, unexpected NEW_IDENTIFIER

Warning: D3D shader compilation failed with avoid flow control flags. Retrying with prefer flow control.
:33:29: error: syntax error, unexpected NEW_IDENTIFIER

Warning: D3D shader compilation failed with prefer flow control flags.:12:17: error: syntax error, unexpected NEW_IDENTIFIER

Warning: D3D shader compilation failed with default flags. Retrying with avoid flow control.
:12:17: error: syntax error, unexpected NEW_IDENTIFIER

Warning: D3D shader compilation failed with avoid flow control flags. Retrying with prefer flow control.
:12:17: error: syntax error, unexpected NEW_IDENTIFIER

Warning: D3D shader compilation failed with prefer flow control flags.
[00:00:00]: Compiled shader debug_line: :29:29: error: syntax error, unexpected NEW_IDENTIFIER

Warning: D3D shader compilation failed with default flags. Retrying with avoid flow control.
:29:29: error: syntax error, unexpected NEW_IDENTIFIER

Warning: D3D shader compilation failed with avoid flow control flags. Retrying with prefer flow control.
:29:29: error: syntax error, unexpected NEW_IDENTIFIER

Warning: D3D shader compilation failed with prefer flow control flags.:12:16: warning: implicit truncation of vector type
Line 30: variable 'gl_main' not declared

Warning: D3D shader compilation failed with default flags. Retrying with avoid flow control.
:12:16: warning: implicit truncation of vector type
Line 30: variable 'gl_main' not declared

Warning: D3D shader compilation failed with avoid flow control flags. Retrying with prefer flow control.
:12:16: warning: implicit truncation of vector type
Line 30: variable 'gl_main' not declared

Warning: D3D shader compilation failed with prefer flow control flags.
[00:00:00]: Compiled shader debug_tri: :33:29: error: syntax error, unexpected NEW_IDENTIFIER

Warning: D3D shader compilation failed with default flags. Retrying with avoid flow control.
:33:29: error: syntax error, unexpected NEW_IDENTIFIER

Warning: D3D shader compilation failed with avoid flow control flags. Retrying with prefer flow control.
:33:29: error: syntax error, unexpected NEW_IDENTIFIER

Warning: D3D shader compilation failed with prefer flow control flags.:12:17: error: syntax error, unexpected NEW_IDENTIFIER

Warning: D3D shader compilation failed with default flags. Retrying with avoid flow control.
:12:17: error: syntax error, unexpected NEW_IDENTIFIER

Warning: D3D shader compilation failed with avoid flow control flags. Retrying with prefer flow control.
:12:17: error: syntax error, unexpected NEW_IDENTIFIER

Warning: D3D shader compilation failed with prefer flow control flags.
[00:00:00]: Renderer initialize: Okay
[00:00:00]: Compiled shader anim: :31:29: error: syntax error, unexpected NEW_IDENTIFIER

Warning: D3D shader compilation failed with default flags. Retrying with avoid flow control.
:31:29: error: syntax error, unexpected NEW_IDENTIFIER

Warning: D3D shader compilation failed with avoid flow control flags. Retrying with prefer flow control.
:31:29: error: syntax error, unexpected NEW_IDENTIFIER

Warning: D3D shader compilation failed with prefer flow control flags.:25:17: error: syntax error, unexpected NEW_IDENTIFIER

Warning: D3D shader compilation failed with default flags. Retrying with avoid flow control.
:25:17: error: syntax error, unexpected NEW_IDENTIFIER

Warning: D3D shader compilation failed with avoid flow control flags. Retrying with prefer flow control.
:25:17: error: syntax error, unexpected NEW_IDENTIFIER

Warning: D3D shader compilation failed with prefer flow control flags.
[00:00:01]: Compiled shader anim_fade: :43:29: error: syntax error, unexpected NEW_IDENTIFIER

Warning: D3D shader compilation failed with default flags. Retrying with avoid flow control.
:43:29: error: syntax error, unexpected NEW_IDENTIFIER

Warning: D3D shader compilation failed with avoid flow control flags. Retrying with prefer flow control.
:43:29: error: syntax error, unexpected NEW_IDENTIFIER

Warning: D3D shader compilation failed with prefer flow control flags.:27:17: error: syntax error, unexpected NEW_IDENTIFIER

Warning: D3D shader compilation failed with default flags. Retrying with avoid flow control.
:27:17: error: syntax error, unexpected NEW_IDENTIFIER

Warning: D3D shader compilation failed with avoid flow control flags. Retrying with prefer flow control.
:27:17: error: syntax error, unexpected NEW_IDENTIFIER

Warning: D3D shader compilation failed with prefer flow control flags.
[00:00:01]: Compiled shader anim_haunted: :31:29: error: syntax error, unexpected NEW_IDENTIFIER

Warning: D3D shader compilation failed with default flags. Retrying with avoid flow control.
:31:29: error: syntax error, unexpected NEW_IDENTIFIER

Warning: D3D shader compilation failed with avoid flow control flags. Retrying with prefer flow control.
:31:29: error: syntax error, unexpected NEW_IDENTIFIER

Warning: D3D shader compilation failed with prefer flow control flags.:28:17: error: syntax error, unexpected NEW_IDENTIFIER

Warning: D3D shader compilation failed with default flags. Retrying with avoid flow control.
:28:17: error: syntax error, unexpected NEW_IDENTIFIER

Warning: D3D shader compilation failed with avoid flow control flags. Retrying with prefer flow control.
:28:17: error: syntax error, unexpected NEW_IDENTIFIER

Warning: D3D shader compilation failed with prefer flow control flags.
[00:00:01]: Compiled shader anim: :31:29: error: syntax error, unexpected NEW_IDENTIFIER

Warning: D3D shader compilation failed with default flags. Retrying with avoid flow control.
:31:29: error: syntax error, unexpected NEW_IDENTIFIER

Warning: D3D shader compilation failed with avoid flow control flags. Retrying with prefer flow control.
:31:29: error: syntax error, unexpected NEW_IDENTIFIER

Warning: D3D shader compilation failed with prefer flow control flags.:25:17: error: syntax error, unexpected NEW_IDENTIFIER

Warning: D3D shader compilation failed with default flags. Retrying with avoid flow control.
:25:17: error: syntax error, unexpected NEW_IDENTIFIER

Warning: D3D shader compilation failed with avoid flow control flags. Retrying with prefer flow control.
:25:17: error: syntax error, unexpected NEW_IDENTIFIER

Warning: D3D shader compilation failed with prefer flow control flags.
[00:00:01]: Compiled shader anim_bloom_haunted: :31:29: error: syntax error, unexpected NEW_IDENTIFIER

Warning: D3D shader compilation failed with default flags. Retrying with avoid flow control.
:31:29: error: syntax error, unexpected NEW_IDENTIFIER

Warning: D3D shader compilation failed with avoid flow control flags. Retrying with prefer flow control.
:31:29: error: syntax error, unexpected NEW_IDENTIFIER

Warning: D3D shader compilation failed with prefer flow control flags.:32:17: error: syntax error, unexpected NEW_IDENTIFIER

Warning: D3D shader compilation failed with default flags. Retrying with avoid flow control.
:32:17: error: syntax error, unexpected NEW_IDENTIFIER

Warning: D3D shader compilation failed with avoid flow control flags. Retrying with prefer flow control.
:32:17: error: syntax error, unexpected NEW_IDENTIFIER

Warning: D3D shader compilation failed with prefer flow control flags.
[00:00:01]: Compiled shader anim_bloom: :29:29: error: syntax error, unexpected NEW_IDENTIFIER

Warning: D3D shader compilation failed with default flags. Retrying with avoid flow control.
:29:29: error: syntax error, unexpected NEW_IDENTIFIER

Warning: D3D shader compilation failed with avoid flow control flags. Retrying with prefer flow control.
:29:29: error: syntax error, unexpected NEW_IDENTIFIER

Warning: D3D shader compilation failed with prefer flow control flags.:15:17: error: syntax error, unexpected NEW_IDENTIFIER

Warning: D3D shader compilation failed with default flags. Retrying with avoid flow control.
:15:17: error: syntax error, unexpected NEW_IDENTIFIER

Warning: D3D shader compilation failed with avoid flow control flags. Retrying with prefer flow control.
:15:17: error: syntax error, unexpected NEW_IDENTIFIER

Warning: D3D shader compilation failed with prefer flow control flags.
[00:00:01]: Compiled shader anim_fade_haunted: :43:29: error: syntax error, unexpected NEW_IDENTIFIER

Warning: D3D shader compilation failed with default flags. Retrying with avoid flow control.
:43:29: error: syntax error, unexpected NEW_IDENTIFIER

Warning: D3D shader compilation failed with avoid flow control flags. Retrying with prefer flow control.
:43:29: error: syntax error, unexpected NEW_IDENTIFIER

Warning: D3D shader compilation failed with prefer flow control flags.:30:17: error: syntax error, unexpected NEW_IDENTIFIER

Warning: D3D shader compilation failed with default flags. Retrying with avoid flow control.
:30:17: error: syntax error, unexpected NEW_IDENTIFIER

Warning: D3D shader compilation failed with avoid flow control flags. Retrying with prefer flow control.
:30:17: error: syntax error, unexpected NEW_IDENTIFIER

Warning: D3D shader compilation failed with prefer flow control flags.
[00:00:01]: Compiled shader anim_fade: :43:29: error: syntax error, unexpected NEW_IDENTIFIER

Warning: D3D shader compilation failed with default flags. Retrying with avoid flow control.
:43:29: error: syntax error, unexpected NEW_IDENTIFIER

Warning: D3D shader compilation failed with avoid flow control flags. Retrying with prefer flow control.
:43:29: error: syntax error, unexpected NEW_IDENTIFIER

Warning: D3D shader compilation failed with prefer flow control flags.:27:17: error: syntax error, unexpected NEW_IDENTIFIER

Warning: D3D shader compilation failed with default flags. Retrying with avoid flow control.
:27:17: error: syntax error, unexpected NEW_IDENTIFIER

Warning: D3D shader compilation failed with avoid flow control flags. Retrying with prefer flow control.
:27:17: error: syntax error, unexpected NEW_IDENTIFIER

Warning: D3D shader compilation failed with prefer flow control flags.
[00:00:01]: AnimManager initialize: Okay
[00:00:01]: Compiled shader lighting: :27:29: error: syntax error, unexpected NEW_IDENTIFIER

Warning: D3D shader compilation failed with default flags. Retrying with avoid flow control.
:27:29: error: syntax error, unexpected NEW_IDENTIFIER

Warning: D3D shader compilation failed with avoid flow control flags. Retrying with prefer flow control.
:27:29: error: syntax error, unexpected NEW_IDENTIFIER

Warning: D3D shader compilation failed with prefer flow control flags.:24:23: error: syntax error, unexpected NEW_IDENTIFIER

Warning: D3D shader compilation failed with default flags. Retrying with avoid flow control.
:24:23: error: syntax error, unexpected NEW_IDENTIFIER

Warning: D3D shader compilation failed with avoid flow control flags. Retrying with prefer flow control.
:24:23: error: syntax error, unexpected NEW_IDENTIFIER

Warning: D3D shader compilation failed with prefer flow control flags.
[00:00:01]: ERROR: HWTexture::DeserializeTexture failed on light_buffer. glGetError returned 0x502
[00:00:01]: 640x360 format: 0x1908 mips: 1
[00:00:01]: Compiled shader render_depth: :28:29: error: syntax error, unexpected NEW_IDENTIFIER

Warning: D3D shader compilation failed with default flags. Retrying with avoid flow control.
:28:29: error: syntax error, unexpected NEW_IDENTIFIER

Warning: D3D shader compilation failed with avoid flow control flags. Retrying with prefer flow control.
:28:29: error: syntax error, unexpected NEW_IDENTIFIER

Warning: D3D shader compilation failed with prefer flow control flags.Line 21: variable 'vec4' not declared

Warning: D3D shader compilation failed with default flags. Retrying with avoid flow control.
Line 21: variable 'vec4' not declared

Warning: D3D shader compilation failed with avoid flow control flags. Retrying with prefer flow control.
Line 21: variable 'vec4' not declared

Warning: D3D shader compilation failed with prefer flow control flags.
[00:00:01]: Compiled shader debug_tri: :33:29: error: syntax error, unexpected NEW_IDENTIFIER

Warning: D3D shader compilation failed with default flags. Retrying with avoid flow control.
:33:29: error: syntax error, unexpected NEW_IDENTIFIER

Warning: D3D shader compilation failed with avoid flow control flags. Retrying with prefer flow control.
:33:29: error: syntax error, unexpected NEW_IDENTIFIER

Warning: D3D shader compilation failed with prefer flow control flags.:12:17: error: syntax error, unexpected NEW_IDENTIFIER

Warning: D3D shader compilation failed with default flags. Retrying with avoid flow control.
:12:17: error: syntax error, unexpected NEW_IDENTIFIER

Warning: D3D shader compilation failed with avoid flow control flags. Retrying with prefer flow control.
:12:17: error: syntax error, unexpected NEW_IDENTIFIER

Warning: D3D shader compilation failed with prefer flow control flags.
[00:00:01]: ERROR: HWTexture::DeserializeTexture failed on depth_buffer. glGetError returned 0x502
[00:00:01]: 1280x720 format: 0x1908 mips: 1
[00:00:01]: Buffers initialize: Okay
[00:00:01]: Compiled shader blurh: Line 23: variable 'vec4' not declared

Warning: D3D shader compilation failed with default flags. Retrying with avoid flow control.
Line 23: variable 'vec4' not declared

Warning: D3D shader compilation failed with avoid flow control flags. Retrying with prefer flow control.
Line 23: variable 'vec4' not declared

Warning: D3D shader compilation failed with prefer flow control flags.:16:17: error: syntax error, unexpected NEW_IDENTIFIER

Warning: D3D shader compilation failed with default flags. Retrying with avoid flow control.
:16:17: error: syntax error, unexpected NEW_IDENTIFIER

Warning: D3D shader compilation failed with avoid flow control flags. Retrying with prefer flow control.
:16:17: error: syntax error, unexpected NEW_IDENTIFIER

Warning: D3D shader compilation failed with prefer flow control flags.
[00:00:01]: Compiled shader blurv: Line 23: variable 'vec4' not declared

Warning: D3D shader compilation failed with default flags. Retrying with avoid flow control.
Line 23: variable 'vec4' not declared

Warning: D3D shader compilation failed with avoid flow control flags. Retrying with prefer flow control.
Line 23: variable 'vec4' not declared

Warning: D3D shader compilation failed with prefer flow control flags.:16:17: error: syntax error, unexpected NEW_IDENTIFIER

Warning: D3D shader compilation failed with default flags. Retrying with avoid flow control.
:16:17: error: syntax error, unexpected NEW_IDENTIFIER

Warning: D3D shader compilation failed with avoid flow control flags. Retrying with prefer flow control.
:16:17: error: syntax error, unexpected NEW_IDENTIFIER

Warning: D3D shader compilation failed with prefer flow control flags.
[00:00:01]: Compiled shader combine_colour_cubes: Line 23: variable 'vec4' not declared

Warning: D3D shader compilation failed with default flags. Retrying with avoid flow control.
Line 23: variable 'vec4' not declared

Warning: D3D shader compilation failed with avoid flow control flags. Retrying with prefer flow control.
Line 23: variable 'vec4' not declared

Warning: D3D shader compilation failed with prefer flow control flags.:16:17: error: syntax error, unexpected NEW_IDENTIFIER

Warning: D3D shader compilation failed with default flags. Retrying with avoid flow control.
:16:17: error: syntax error, unexpected NEW_IDENTIFIER

Warning: D3D shader compilation failed with avoid flow control flags. Retrying with prefer flow control.
:16:17: error: syntax error, unexpected NEW_IDENTIFIER

Warning: D3D shader compilation failed with prefer flow control flags.
[00:00:02]: Compiled shader postprocess: Line 25: variable 'vec4' not declared

Warning: D3D shader compilation failed with default flags. Retrying with avoid flow control.
Line 25: variable 'vec4' not declared

Warning: D3D shader compilation failed with avoid flow control flags. Retrying with prefer flow control.
Line 25: variable 'vec4' not declared

Warning: D3D shader compilation failed with prefer flow control flags.:20:17: error: syntax error, unexpected NEW_IDENTIFIER

Warning: D3D shader compilation failed with default flags. Retrying with avoid flow control.
:20:17: error: syntax error, unexpected NEW_IDENTIFIER

Warning: D3D shader compilation failed with avoid flow control flags. Retrying with prefer flow control.
:20:17: error: syntax error, unexpected NEW_IDENTIFIER

Warning: D3D shader compilation failed with prefer flow control flags.
[00:00:02]: Compiled shader postprocessbloom: Line 25: variable 'vec4' not declared

Warning: D3D shader compilation failed with default flags. Retrying with avoid flow control.
Line 25: variable 'vec4' not declared

Warning: D3D shader compilation failed with avoid flow control flags. Retrying with prefer flow control.
Line 25: variable 'vec4' not declared

Warning: D3D shader compilation failed with prefer flow control flags.:20:17: error: syntax error, unexpected NEW_IDENTIFIER

Warning: D3D shader compilation failed with default flags. Retrying with avoid flow control.
:20:17: error: syntax error, unexpected NEW_IDENTIFIER

Warning: D3D shader compilation failed with avoid flow control flags. Retrying with prefer flow control.
:20:17: error: syntax error, unexpected NEW_IDENTIFIER

Warning: D3D shader compilation failed with prefer flow control flags.
[00:00:02]: Compiled shader postprocessdistort: Line 31: variable 'vec4' not declared

Warning: D3D shader compilation failed with default flags. Retrying with avoid flow control.
Line 31: variable 'vec4' not declared

Warning: D3D shader compilation failed with avoid flow control flags. Retrying with prefer flow control.
Line 31: variable 'vec4' not declared

Warning: D3D shader compilation failed with prefer flow control flags.:22:17: error: syntax error, unexpected NEW_IDENTIFIER

Warning: D3D shader compilation failed with default flags. Retrying with avoid flow control.
:22:17: error: syntax error, unexpected NEW_IDENTIFIER

Warning: D3D shader compilation failed with avoid flow control flags. Retrying with prefer flow control.
:22:17: error: syntax error, unexpected NEW_IDENTIFIER

Warning: D3D shader compilation failed with prefer flow control flags.
[00:00:02]: Compiled shader postprocessbloomdistort: Line 31: variable 'vec4' not declared

Warning: D3D shader compilation failed with default flags. Retrying with avoid flow control.
Line 31: variable 'vec4' not declared

Warning: D3D shader compilation failed with avoid flow control flags. Retrying with prefer flow control.
Line 31: variable 'vec4' not declared

Warning: D3D shader compilation failed with prefer flow control flags.:22:17: error: syntax error, unexpected NEW_IDENTIFIER

Warning: D3D shader compilation failed with default flags. Retrying with avoid flow control.
:22:17: error: syntax error, unexpected NEW_IDENTIFIER

Warning: D3D shader compilation failed with avoid flow control flags. Retrying with prefer flow control.
:22:17: error: syntax error, unexpected NEW_IDENTIFIER

Warning: D3D shader compilation failed with prefer flow control flags.
[00:00:02]: ERROR: HWTexture::DeserializeTexture failed on bloom_buffer. glGetError returned 0x502
[00:00:02]: 320x180 format: 0x1907 mips: 1
[00:00:02]: cDontStarveGame::DoGameSpecificInitialize()
[00:00:02]: GameSpecific initialize: Okay
[00:00:02]: cGame::StartPlaying
[00:00:02]: LOADING LUA
[00:00:02]: DoLuaFile scripts/main.lua
[00:00:02]: DoLuaFile loading buffer scripts/main.lua
[00:00:02]:   taskgrouplist:	default	Together	
[00:00:02]:   taskgrouplist:	classic	Classic	
[00:00:02]:   taskgrouplist:	cave_default	Underground	
[00:00:02]:   taskgrouplist:	lavaarena_taskset	The Forge	
[00:00:02]:   taskgrouplist:	quagmire_taskset	The Gorge	
[00:00:02]: running main.lua
	
[00:00:02]: loaded modindex	
[00:00:02]: Event data unavailable: lavaarena_event_server/lavaarena_achievement_quest_defs
[00:00:02]: Compiled shader anim_bloom: :29:29: error: syntax error, unexpected NEW_IDENTIFIER

Warning: D3D shader compilation failed with default flags. Retrying with avoid flow control.
:29:29: error: syntax error, unexpected NEW_IDENTIFIER

Warning: D3D shader compilation failed with avoid flow control flags. Retrying with prefer flow control.
:29:29: error: syntax error, unexpected NEW_IDENTIFIER

Warning: D3D shader compilation failed with prefer flow control flags.:15:17: error: syntax error, unexpected NEW_IDENTIFIER

Warning: D3D shader compilation failed with default flags. Retrying with avoid flow control.
:15:17: error: syntax error, unexpected NEW_IDENTIFIER

Warning: D3D shader compilation failed with avoid flow control flags. Retrying with prefer flow control.
:15:17: error: syntax error, unexpected NEW_IDENTIFIER

Warning: D3D shader compilation failed with prefer flow control flags.
[00:00:02]: Compiled shader anim_bloom_ghost: :31:29: error: syntax error, unexpected NEW_IDENTIFIER

Warning: D3D shader compilation failed with default flags. Retrying with avoid flow control.
:31:29: error: syntax error, unexpected NEW_IDENTIFIER

Warning: D3D shader compilation failed with avoid flow control flags. Retrying with prefer flow control.
:31:29: error: syntax error, unexpected NEW_IDENTIFIER

Warning: D3D shader compilation failed with prefer flow control flags.:25:17: error: syntax error, unexpected NEW_IDENTIFIER

Warning: D3D shader compilation failed with default flags. Retrying with avoid flow control.
:25:17: error: syntax error, unexpected NEW_IDENTIFIER

Warning: D3D shader compilation failed with avoid flow control flags. Retrying with prefer flow control.
:25:17: error: syntax error, unexpected NEW_IDENTIFIER

Warning: D3D shader compilation failed with prefer flow control flags.
[00:00:02]: Compiled shader road: :29:19: error: syntax error, unexpected NEW_IDENTIFIER

Warning: D3D shader compilation failed with default flags. Retrying with avoid flow control.
:29:19: error: syntax error, unexpected NEW_IDENTIFIER

Warning: D3D shader compilation failed with avoid flow control flags. Retrying with prefer flow control.
:29:19: error: syntax error, unexpected NEW_IDENTIFIER

Warning: D3D shader compilation failed with prefer flow control flags.:19:17: error: syntax error, unexpected NEW_IDENTIFIER

Warning: D3D shader compilation failed with default flags. Retrying with avoid flow control.
:19:17: error: syntax error, unexpected NEW_IDENTIFIER

Warning: D3D shader compilation failed with avoid flow control flags. Retrying with prefer flow control.
:19:17: error: syntax error, unexpected NEW_IDENTIFIER

Warning: D3D shader compilation failed with prefer flow control flags.
[00:00:02]: ERROR: HWTexture::DeserializeTexture failed on images/shadow.tex. glGetError returned 0x502
[00:00:02]: 128x128 format: 0x83f3 mips: 8
[00:00:02]: Compiled shader anim: :31:29: error: syntax error, unexpected NEW_IDENTIFIER

Warning: D3D shader compilation failed with default flags. Retrying with avoid flow control.
:31:29: error: syntax error, unexpected NEW_IDENTIFIER

Warning: D3D shader compilation failed with avoid flow control flags. Retrying with prefer flow control.
:31:29: error: syntax error, unexpected NEW_IDENTIFIER

Warning: D3D shader compilation failed with prefer flow control flags.:25:17: error: syntax error, unexpected NEW_IDENTIFIER

Warning: D3D shader compilation failed with default flags. Retrying with avoid flow control.
:25:17: error: syntax error, unexpected NEW_IDENTIFIER

Warning: D3D shader compilation failed with avoid flow control flags. Retrying with prefer flow control.
:25:17: error: syntax error, unexpected NEW_IDENTIFIER

Warning: D3D shader compilation failed with prefer flow control flags.
[00:00:03]: Compiled shader anim_fade: :43:29: error: syntax error, unexpected NEW_IDENTIFIER

Warning: D3D shader compilation failed with default flags. Retrying with avoid flow control.
:43:29: error: syntax error, unexpected NEW_IDENTIFIER

Warning: D3D shader compilation failed with avoid flow control flags. Retrying with prefer flow control.
:43:29: error: syntax error, unexpected NEW_IDENTIFIER

Warning: D3D shader compilation failed with prefer flow control flags.:27:17: error: syntax error, unexpected NEW_IDENTIFIER

Warning: D3D shader compilation failed with default flags. Retrying with avoid flow control.
:27:17: error: syntax error, unexpected NEW_IDENTIFIER

Warning: D3D shader compilation failed with avoid flow control flags. Retrying with prefer flow control.
:27:17: error: syntax error, unexpected NEW_IDENTIFIER

Warning: D3D shader compilation failed with prefer flow control flags.
[00:00:03]: Compiled shader anim_bloom: :29:29: error: syntax error, unexpected NEW_IDENTIFIER

Warning: D3D shader compilation failed with default flags. Retrying with avoid flow control.
:29:29: error: syntax error, unexpected NEW_IDENTIFIER

Warning: D3D shader compilation failed with avoid flow control flags. Retrying with prefer flow control.
:29:29: error: syntax error, unexpected NEW_IDENTIFIER

Warning: D3D shader compilation failed with prefer flow control flags.:15:17: error: syntax error, unexpected NEW_IDENTIFIER

Warning: D3D shader compilation failed with default flags. Retrying with avoid flow control.
:15:17: error: syntax error, unexpected NEW_IDENTIFIER

Warning: D3D shader compilation failed with avoid flow control flags. Retrying with prefer flow control.
:15:17: error: syntax error, unexpected NEW_IDENTIFIER

Warning: D3D shader compilation failed with prefer flow control flags.
[00:00:03]: Compiled shader blurh: Line 23: variable 'vec4' not declared

Warning: D3D shader compilation failed with default flags. Retrying with avoid flow control.
Line 23: variable 'vec4' not declared

Warning: D3D shader compilation failed with avoid flow control flags. Retrying with prefer flow control.
Line 23: variable 'vec4' not declared

Warning: D3D shader compilation failed with prefer flow control flags.:16:17: error: syntax error, unexpected NEW_IDENTIFIER

Warning: D3D shader compilation failed with default flags. Retrying with avoid flow control.
:16:17: error: syntax error, unexpected NEW_IDENTIFIER

Warning: D3D shader compilation failed with avoid flow control flags. Retrying with prefer flow control.
:16:17: error: syntax error, unexpected NEW_IDENTIFIER

Warning: D3D shader compilation failed with prefer flow control flags.
[00:00:03]: Compiled shader blurv: Line 23: variable 'vec4' not declared

Warning: D3D shader compilation failed with default flags. Retrying with avoid flow control.
Line 23: variable 'vec4' not declared

Warning: D3D shader compilation failed with avoid flow control flags. Retrying with prefer flow control.
Line 23: variable 'vec4' not declared

Warning: D3D shader compilation failed with prefer flow control flags.:16:17: error: syntax error, unexpected NEW_IDENTIFIER

Warning: D3D shader compilation failed with default flags. Retrying with avoid flow control.
:16:17: error: syntax error, unexpected NEW_IDENTIFIER

Warning: D3D shader compilation failed with avoid flow control flags. Retrying with prefer flow control.
:16:17: error: syntax error, unexpected NEW_IDENTIFIER

Warning: D3D shader compilation failed with prefer flow control flags.
[00:00:03]: Compiled shader creep: :29:19: error: syntax error, unexpected NEW_IDENTIFIER

Warning: D3D shader compilation failed with default flags. Retrying with avoid flow control.
:29:19: error: syntax error, unexpected NEW_IDENTIFIER

Warning: D3D shader compilation failed with avoid flow control flags. Retrying with prefer flow control.
:29:19: error: syntax error, unexpected NEW_IDENTIFIER

Warning: D3D shader compilation failed with prefer flow control flags.:19:17: error: syntax error, unexpected NEW_IDENTIFIER

Warning: D3D shader compilation failed with default flags. Retrying with avoid flow control.
:19:17: error: syntax error, unexpected NEW_IDENTIFIER

Warning: D3D shader compilation failed with avoid flow control flags. Retrying with prefer flow control.
:19:17: error: syntax error, unexpected NEW_IDENTIFIER

Warning: D3D shader compilation failed with prefer flow control flags.
[00:00:03]: Compiled shader debug_line: :29:29: error: syntax error, unexpected NEW_IDENTIFIER

Warning: D3D shader compilation failed with default flags. Retrying with avoid flow control.
:29:29: error: syntax error, unexpected NEW_IDENTIFIER

Warning: D3D shader compilation failed with avoid flow control flags. Retrying with prefer flow control.
:29:29: error: syntax error, unexpected NEW_IDENTIFIER

Warning: D3D shader compilation failed with prefer flow control flags.:12:16: warning: implicit truncation of vector type
Line 30: variable 'gl_main' not declared

Warning: D3D shader compilation failed with default flags. Retrying with avoid flow control.
:12:16: warning: implicit truncation of vector type
Line 30: variable 'gl_main' not declared

Warning: D3D shader compilation failed with avoid flow control flags. Retrying with prefer flow control.
:12:16: warning: implicit truncation of vector type
Line 30: variable 'gl_main' not declared

Warning: D3D shader compilation failed with prefer flow control flags.
[00:00:03]: Compiled shader debug_tri: :33:29: error: syntax error, unexpected NEW_IDENTIFIER

Warning: D3D shader compilation failed with default flags. Retrying with avoid flow control.
:33:29: error: syntax error, unexpected NEW_IDENTIFIER

Warning: D3D shader compilation failed with avoid flow control flags. Retrying with prefer flow control.
:33:29: error: syntax error, unexpected NEW_IDENTIFIER

Warning: D3D shader compilation failed with prefer flow control flags.:12:17: error: syntax error, unexpected NEW_IDENTIFIER

Warning: D3D shader compilation failed with default flags. Retrying with avoid flow control.
:12:17: error: syntax error, unexpected NEW_IDENTIFIER

Warning: D3D shader compilation failed with avoid flow control flags. Retrying with prefer flow control.
:12:17: error: syntax error, unexpected NEW_IDENTIFIER

Warning: D3D shader compilation failed with prefer flow control flags.
[00:00:03]: Compiled shader render_depth: :28:29: error: syntax error, unexpected NEW_IDENTIFIER

Warning: D3D shader compilation failed with default flags. Retrying with avoid flow control.
:28:29: error: syntax error, unexpected NEW_IDENTIFIER

Warning: D3D shader compilation failed with avoid flow control flags. Retrying with prefer flow control.
:28:29: error: syntax error, unexpected NEW_IDENTIFIER

Warning: D3D shader compilation failed with prefer flow control flags.Line 21: variable 'vec4' not declared

Warning: D3D shader compilation failed with default flags. Retrying with avoid flow control.
Line 21: variable 'vec4' not declared

Warning: D3D shader compilation failed with avoid flow control flags. Retrying with prefer flow control.
Line 21: variable 'vec4' not declared

Warning: D3D shader compilation failed with prefer flow control flags.
[00:00:03]: Compiled shader font: :37:29: error: syntax error, unexpected NEW_IDENTIFIER

Warning: D3D shader compilation failed with default flags. Retrying with avoid flow control.
:37:29: error: syntax error, unexpected NEW_IDENTIFIER

Warning: D3D shader compilation failed with avoid flow control flags. Retrying with prefer flow control.
:37:29: error: syntax error, unexpected NEW_IDENTIFIER

Warning: D3D shader compilation failed with prefer flow control flags.:12:17: error: syntax error, unexpected NEW_IDENTIFIER

Warning: D3D shader compilation failed with default flags. Retrying with avoid flow control.
:12:17: error: syntax error, unexpected NEW_IDENTIFIER

Warning: D3D shader compilation failed with avoid flow control flags. Retrying with prefer flow control.
:12:17: error: syntax error, unexpected NEW_IDENTIFIER

Warning: D3D shader compilation failed with prefer flow control flags.
[00:00:03]: Compiled shader font_packed: :37:29: error: syntax error, unexpected NEW_IDENTIFIER

Warning: D3D shader compilation failed with default flags. Retrying with avoid flow control.
:37:29: error: syntax error, unexpected NEW_IDENTIFIER

Warning: D3D shader compilation failed with avoid flow control flags. Retrying with prefer flow control.
:37:29: error: syntax error, unexpected NEW_IDENTIFIER

Warning: D3D shader compilation failed with prefer flow control flags.:17:17: error: syntax error, unexpected NEW_IDENTIFIER

Warning: D3D shader compilation failed with default flags. Retrying with avoid flow control.
:17:17: error: syntax error, unexpected NEW_IDENTIFIER

Warning: D3D shader compilation failed with avoid flow control flags. Retrying with prefer flow control.
:17:17: error: syntax error, unexpected NEW_IDENTIFIER

Warning: D3D shader compilation failed with prefer flow control flags.
[00:00:03]: Compiled shader font_packed_outline: :37:29: error: syntax error, unexpected NEW_IDENTIFIER

Warning: D3D shader compilation failed with default flags. Retrying with avoid flow control.
:37:29: error: syntax error, unexpected NEW_IDENTIFIER

Warning: D3D shader compilation failed with avoid flow control flags. Retrying with prefer flow control.
:37:29: error: syntax error, unexpected NEW_IDENTIFIER

Warning: D3D shader compilation failed with prefer flow control flags.:17:17: error: syntax error, unexpected NEW_IDENTIFIER

Warning: D3D shader compilation failed with default flags. Retrying with avoid flow control.
:17:17: error: syntax error, unexpected NEW_IDENTIFIER

Warning: D3D shader compilation failed with avoid flow control flags. Retrying with prefer flow control.
:17:17: error: syntax error, unexpected NEW_IDENTIFIER

Warning: D3D shader compilation failed with prefer flow control flags.
[00:00:03]: Compiled shader ground: :29:19: error: syntax error, unexpected NEW_IDENTIFIER

Warning: D3D shader compilation failed with default flags. Retrying with avoid flow control.
:29:19: error: syntax error, unexpected NEW_IDENTIFIER

Warning: D3D shader compilation failed with avoid flow control flags. Retrying with prefer flow control.
:29:19: error: syntax error, unexpected NEW_IDENTIFIER

Warning: D3D shader compilation failed with prefer flow control flags.:19:17: error: syntax error, unexpected NEW_IDENTIFIER

Warning: D3D shader compilation failed with default flags. Retrying with avoid flow control.
:19:17: error: syntax error, unexpected NEW_IDENTIFIER

Warning: D3D shader compilation failed with avoid flow control flags. Retrying with prefer flow control.
:19:17: error: syntax error, unexpected NEW_IDENTIFIER

Warning: D3D shader compilation failed with prefer flow control flags.
[00:00:03]: Compiled shader ground_overlay: :29:19: error: syntax error, unexpected NEW_IDENTIFIER

Warning: D3D shader compilation failed with default flags. Retrying with avoid flow control.
:29:19: error: syntax error, unexpected NEW_IDENTIFIER

Warning: D3D shader compilation failed with avoid flow control flags. Retrying with prefer flow control.
:29:19: error: syntax error, unexpected NEW_IDENTIFIER

Warning: D3D shader compilation failed with prefer flow control flags.:23:17: error: syntax error, unexpected NEW_IDENTIFIER

Warning: D3D shader compilation failed with default flags. Retrying with avoid flow control.
:23:17: error: syntax error, unexpected NEW_IDENTIFIER

Warning: D3D shader compilation failed with avoid flow control flags. Retrying with prefer flow control.
:23:17: error: syntax error, unexpected NEW_IDENTIFIER

Warning: D3D shader compilation failed with prefer flow control flags.
[00:00:03]: Compiled shader ground_lights: :31:29: error: syntax error, unexpected NEW_IDENTIFIER

Warning: D3D shader compilation failed with default flags. Retrying with avoid flow control.
:31:29: error: syntax error, unexpected NEW_IDENTIFIER

Warning: D3D shader compilation failed with avoid flow control flags. Retrying with prefer flow control.
:31:29: error: syntax error, unexpected NEW_IDENTIFIER

Warning: D3D shader compilation failed with prefer flow control flags.:17:17: error: syntax error, unexpected NEW_IDENTIFIER

Warning: D3D shader compilation failed with default flags. Retrying with avoid flow control.
:17:17: error: syntax error, unexpected NEW_IDENTIFIER

Warning: D3D shader compilation failed with avoid flow control flags. Retrying with prefer flow control.
:17:17: error: syntax error, unexpected NEW_IDENTIFIER

Warning: D3D shader compilation failed with prefer flow control flags.
[00:00:03]: Compiled shader ceiling: :35:29: error: syntax error, unexpected NEW_IDENTIFIER

Warning: D3D shader compilation failed with default flags. Retrying with avoid flow control.
:35:29: error: syntax error, unexpected NEW_IDENTIFIER

Warning: D3D shader compilation failed with avoid flow control flags. Retrying with prefer flow control.
:35:29: error: syntax error, unexpected NEW_IDENTIFIER

Warning: D3D shader compilation failed with prefer flow control flags.:21:17: error: syntax error, unexpected NEW_IDENTIFIER

Warning: D3D shader compilation failed with default flags. Retrying with avoid flow control.
:21:17: error: syntax error, unexpected NEW_IDENTIFIER

Warning: D3D shader compilation failed with avoid flow control flags. Retrying with prefer flow control.
:21:17: error: syntax error, unexpected NEW_IDENTIFIER

Warning: D3D shader compilation failed with prefer flow control flags.
[00:00:03]: Compiled shader triplanar_bg: Line 54: variable 'vec4' not declared

Warning: D3D shader compilation failed with default flags. Retrying with avoid flow control.
Line 54: variable 'vec4' not declared

Warning: D3D shader compilation failed with avoid flow control flags. Retrying with prefer flow control.
Line 54: variable 'vec4' not declared

Warning: D3D shader compilation failed with prefer flow control flags.:27:17: error: syntax error, unexpected NEW_IDENTIFIER

Warning: D3D shader compilation failed with default flags. Retrying with avoid flow control.
:27:17: error: syntax error, unexpected NEW_IDENTIFIER

Warning: D3D shader compilation failed with avoid flow control flags. Retrying with prefer flow control.
:27:17: error: syntax error, unexpected NEW_IDENTIFIER

Warning: D3D shader compilation failed with prefer flow control flags.
[00:00:04]: Compiled shader triplanar_alpha_wall: Line 54: variable 'vec4' not declared

Warning: D3D shader compilation failed with default flags. Retrying with avoid flow control.
Line 54: variable 'vec4' not declared

Warning: D3D shader compilation failed with avoid flow control flags. Retrying with prefer flow control.
Line 54: variable 'vec4' not declared

Warning: D3D shader compilation failed with prefer flow control flags.:27:17: error: syntax error, unexpected NEW_IDENTIFIER

Warning: D3D shader compilation failed with default flags. Retrying with avoid flow control.
:27:17: error: syntax error, unexpected NEW_IDENTIFIER

Warning: D3D shader compilation failed with avoid flow control flags. Retrying with prefer flow control.
:27:17: error: syntax error, unexpected NEW_IDENTIFIER

Warning: D3D shader compilation failed with prefer flow control flags.
[00:00:04]: Compiled shader triplanar_alpha_ceiling: Line 54: variable 'vec4' not declared

Warning: D3D shader compilation failed with default flags. Retrying with avoid flow control.
Line 54: variable 'vec4' not declared

Warning: D3D shader compilation failed with avoid flow control flags. Retrying with prefer flow control.
Line 54: variable 'vec4' not declared

Warning: D3D shader compilation failed with prefer flow control flags.:27:17: error: syntax error, unexpected NEW_IDENTIFIER

Warning: D3D shader compilation failed with default flags. Retrying with avoid flow control.
:27:17: error: syntax error, unexpected NEW_IDENTIFIER

Warning: D3D shader compilation failed with avoid flow control flags. Retrying with prefer flow control.
:27:17: error: syntax error, unexpected NEW_IDENTIFIER

Warning: D3D shader compilation failed with prefer flow control flags.
[00:00:04]: Compiled shader lighting: :27:29: error: syntax error, unexpected NEW_IDENTIFIER

Warning: D3D shader compilation failed with default flags. Retrying with avoid flow control.
:27:29: error: syntax error, unexpected NEW_IDENTIFIER

Warning: D3D shader compilation failed with avoid flow control flags. Retrying with prefer flow control.
:27:29: error: syntax error, unexpected NEW_IDENTIFIER

Warning: D3D shader compilation failed with prefer flow control flags.:24:23: error: syntax error, unexpected NEW_IDENTIFIER

Warning: D3D shader compilation failed with default flags. Retrying with avoid flow control.
:24:23: error: syntax error, unexpected NEW_IDENTIFIER

Warning: D3D shader compilation failed with avoid flow control flags. Retrying with prefer flow control.
:24:23: error: syntax error, unexpected NEW_IDENTIFIER

Warning: D3D shader compilation failed with prefer flow control flags.
[00:00:04]: Compiled shader minimap: :29:19: error: syntax error, unexpected NEW_IDENTIFIER

Warning: D3D shader compilation failed with default flags. Retrying with avoid flow control.
:29:19: error: syntax error, unexpected NEW_IDENTIFIER

Warning: D3D shader compilation failed with avoid flow control flags. Retrying with prefer flow control.
:29:19: error: syntax error, unexpected NEW_IDENTIFIER

... Many more D3D shader warnings later...

Warning: D3D shader compilation failed with prefer flow control flags.
[00:00:07]: LOADING LUA SUCCESS
[00:00:07]: Assert failure 'mEffectHandle != INVALID_RESOURCE_HANDLE' at ..\source\game\render\imagenode.cpp(167): Trace follows...


My inxi -Gff output is:

Code: Select all

CPU:       Topology: Dual Core model: Intel Core i5-6300U bits: 64 type: MT MCP L2 cache: 3072 KiB 
           Speed: 801 MHz min/max: 400/3000 MHz Core speeds (MHz): 1: 799 2: 800 3: 800 4: 800 
           Flags: 3dnowprefetch abm acpi adx aes aperfmperf apic arat arch_perfmon art avx avx2 bmi1 bmi2 bts clflush 
           clflushopt cmov constant_tsc cpuid cpuid_fault cx16 cx8 de ds_cpl dtes64 dtherm dts epb ept ept_ad erms est f16c 
           flexpriority flush_l1d fma fpu fsgsbase fxsr hle ht hwp hwp_act_window hwp_epp hwp_notify ibpb ibrs ida intel_pt 
           invpcid invpcid_single lahf_lm lm mca mce mmx monitor movbe mpx msr mtrr nonstop_tsc nopl nx pae pat pbe pcid 
           pclmulqdq pdcm pdpe1gb pebs pge pln pni popcnt pse pse36 pti pts rdrand rdseed rdtscp rep_good rtm sdbg sep smap 
           smep smx ss ssbd sse sse2 sse4_1 sse4_2 ssse3 stibp syscall tm tm2 tpr_shadow tsc tsc_adjust tsc_deadline_timer 
           tsc_known_freq vme vmx vnmi vpid x2apic xgetbv1 xsave xsavec xsaveopt xsaves xtopology xtpr 
Graphics:  Device-1: Intel Skylake GT2 [HD Graphics 520] driver: i915 v: kernel 
           Display: server: X.Org 1.20.3 driver: modesetting resolution: 1366x768~60Hz 
           OpenGL: renderer: Mesa DRI Intel HD Graphics 520 (Skylake GT2) v: 4.5 Mesa 18.3.1 
I'm suspecting this has something to do with my graphics card drivers? The .exe is a game (Don't Starve Together). Thanks in advance.

User avatar
Bob Wya
Level 12
Level 12
Posts: 2759
Joined: Sat Oct 16, 2010 7:40 pm
Location: Cambridge
Contact:

Re: D3D Shader Compilation Fails

Post by Bob Wya » Mon Jan 28, 2019 6:42 am

@ttragedia

We'd need a Wine terminal log to troubleshoot this issue.
See: WineHQ FAQ: 10.1.1 How can I get a debugging log (a.k.a. terminal output)?

You'd probably want to enable the following Wine debug channels:

Code: Select all

export WINEDEBUG=+timestamp,+tid,+loaddll,+wgl,+d3d
Please post this log on an online text pasting site.

See also: WineHQ User's Guide: 3 Using Wine.

Also what's the output from:

Code: Select all

glxinfo | egrep '^OpenGL'
I've not had much Wine success, with my craptop, which only has an Intel Ivybridge iGP.
The Intel driver Core OpenGL profile, is missing a lot of extensions required by Wine (on my machine anyway).

Also your graphics card is new enough to support Intel's ANV Vulkan driver.
So that's also worth a shot, for any DX10/DX11 games you might want to try and run.


Bob

ttragedia
Newbie
Newbie
Posts: 3
Joined: Sun Jan 27, 2019 6:04 pm

Re: D3D Shader Compilation Fails

Post by ttragedia » Mon Jan 28, 2019 7:15 pm

Hello Bob,

Thanks for your help, I'm going to look into using vulkan and also try different settings with insights gained from the wiki, then post the results. Sorry for not posting the debug log, I am not really experienced with wine (used it only a handful of times). Here it is (14M was too much for most text pasting sites):

Google Drive Link

The output is:

Code: Select all

OpenGL vendor string: Intel Open Source Technology Center
OpenGL renderer string: Mesa DRI Intel(R) HD Graphics 520 (Skylake GT2) 
OpenGL core profile version string: 4.5 (Core Profile) Mesa 18.3.1
OpenGL core profile shading language version string: 4.50
OpenGL core profile context flags: (none)
OpenGL core profile profile mask: core profile
OpenGL core profile extensions:
OpenGL version string: 3.0 Mesa 18.3.1
OpenGL shading language version string: 1.30
OpenGL context flags: (none)
OpenGL extensions:
OpenGL ES profile version string: OpenGL ES 3.2 Mesa 18.3.1
OpenGL ES profile shading language version string: OpenGL ES GLSL ES 3.20
OpenGL ES profile extensions:
I might have the same fate as you and I may need to use a vm or something since my laptop was not even intended to be used for gaming.

User avatar
Bob Wya
Level 12
Level 12
Posts: 2759
Joined: Sat Oct 16, 2010 7:40 pm
Location: Cambridge
Contact:

Re: D3D Shader Compilation Fails

Post by Bob Wya » Tue Jan 29, 2019 8:29 am

@ttragedia
  • FYI Github Gists can be massive (100 Gb I think is the individual file limit??)
    I try to avoid recommending specific sites - to avoid appearing to be "shill" (also people often like to use specific sites).
  • Looking at your Wine log:

    Code: Select all

    18692.343:0009:trace:loaddll:load_builtin_dll Loaded L"C:\\windows\\system32\\d3dcompiler_43.dll" at 0xf5890000: builtin
    Have you tried:

    Code: Select all

    winetricks d3dcompiler_43
    ?
  • Looking at your Wine log again:

    Code: Select all

    18691.893:0009:trace:d3d:wined3d_adapter_init_gl_caps GL_RENDERER: "Mesa DRI Intel(R) HD Graphics 520 (Skylake GT2) x86/MMX/SSE2".
    18691.893:0009:trace:d3d:wined3d_adapter_init_gl_caps GL_VENDOR: "Intel Open Source Technology Center".
    18691.893:0009:trace:d3d:wined3d_adapter_init_gl_caps GL_VERSION: "4.5 (Core Profile) Mesa 18.3.1".
    18691.893:0009:trace:d3d:wined3d_parse_gl_version Found OpenGL version 4.5.
    OpenGL Core Profile...
    Que? You might ask !! :? :lol:

    See: https://www.khronos.org/opengl/wiki/OpenGL_Context
    Essentially an OpenGL Core Profile, means "we fully support this OpenGL version but do not support earlier OpenGL versions".

    Code: Select all

    18691.877:0009:trace:wgl:X11DRV_WineGL_InitOpenglInfo GL version             : 3.0 Mesa 18.3.1.
    18691.877:0009:trace:wgl:X11DRV_WineGL_InitOpenglInfo GL renderer            : Mesa DRI Intel(R) HD Graphics 520 (Skylake GT2) x86/MMX/SSE2.
    This is a full OpenGL profile (i.e. earlier OpenGL versions are supported, so it's kind of like a "superset" of OpenGL versions).

    But OpenGL 3.0 is a bit old to support the newer extensions that wined3d needs for DirectX 9.0c support.

    I think newer versions of Wine will select the newer / higher OpenGL version (??)
    I'm not clear whether Wine use's any legacy OpenGL extensions, or whether it can work fully on the OpenGL 4.5 (Core Profile).

    If necessary I'll ask the Wine D3D Developers for some help.
Don't give up hope on your Intel card... 8)
My card is significantly older...
At least yours supports Vulkan.

if you get stuck you can always just play 0ad - like I've done, on my craptop. 8)

Bob

ttragedia
Newbie
Newbie
Posts: 3
Joined: Sun Jan 27, 2019 6:04 pm

Re: D3D Shader Compilation Fails

Post by ttragedia » Wed Jan 30, 2019 9:26 am

Have you tried:

Code: Select all

winetricks d3dcompiler_43
?
Woah, It works!!! Thank you very very much for your help.

I always installed almost all of the d3d related components at once and it wasn't working. I don't know if there was some conflict or something of that sort.

TBH, that OpenGL profile thing is weird and kinda dissappointing. The gap between the full and core version numbers is huge. Is there that many deprecated/obsolete features between these two modern OpenGL versions that it is really an effort to implement them? I never knew.

0ad looks supercool though! I am definitely playing it tonight! Thanks again for all your help.

User avatar
Bob Wya
Level 12
Level 12
Posts: 2759
Joined: Sat Oct 16, 2010 7:40 pm
Location: Cambridge
Contact:

Re: D3D Shader Compilation Fails

Post by Bob Wya » Mon Feb 04, 2019 1:09 pm

ttragedia wrote:...

Woah, It works!!! Thank you very very much for your help.

I always installed almost all of the d3d related components at once and it wasn't working. I don't know if there was some conflict or something of that sort.

TBH, that OpenGL profile thing is weird and kinda disappointing. The gap between the full and core version numbers is huge. Is there that many deprecated/obsolete features between these two modern OpenGL versions that it is really an effort to implement them? I never knew.

0ad looks supercool though! I am definitely playing it tonight! Thanks again for all your help.
Ah nice, that's great! 8)

Don't sweat the OpenGL profile stuff.
It does look like Wine is selecting OpenGL Core profiles now.

Watch out, 0ad is very addictive! :mrgreen:

Bob

Post Reply